Target
Sodium channel protein type 4 subunit alpha
Ligand
BDBM50141069
Substrate
Meas. Tech.
ChEMBL_202570 (CHEMBL805351)
Ki
690±n/a nM
Citation
 Yang, JGharagozloo, PYao, JIlyin, VICarter, RBNguyen, PRobledo, SWoodward, RMHogenkamp, DJ 3-(4-phenoxyphenyl)pyrazoles: a novel class of sodium channel blockers. J Med Chem 47:1547-52 (2004)  
Target
Name:
Sodium channel protein type 4 subunit alpha
Synonyms:
SCN4A SkM1 Sodium channel protein skeletal muscle subunit alpha Sodium channel protein type IV alpha subunit Voltage-gated sodium channel subunit alpha Nav1.4 | Voltage-gated sodium channel subunit alpha Nav1.4 (Nav1.4)
Type:
Protein
Mol. Mass.:
208010.01
Organism:
Homo sapiens (Human)
Description:
P35499
Residue:
1836
  
Inhibitor
Name:
BDBM50141069
Synonyms:
3-[4-(4-Fluoro-phenoxy)-phenyl]-1-methyl-1H-pyrazole | CHEMBL38970
Type:
Small organic molecule
Emp. Form.:
C16H13FN2O
Mol. Mass.:
268.2856
SMILES:
Cn1ccc(n1)-c1ccc(Oc2ccc(F)cc2)cc1
: