Target
B2 bradykinin receptor
Ligand
BDBM50067311
Substrate
Meas. Tech.
ChEMBL_40292 (CHEMBL653424)
IC50
56±n/a nM
Citation
 Sawada, YKayakiri, HAbe, YImai, KMizutani, TInamura, NAsano, MAramori, IHatori, CKatayama, AOku, TTanaka, H A new series of highly potent non-peptide bradykinin B2 receptor antagonists incorporating the 4-heteroarylquinoline framework. Improvement of aqueous solubility and new insights into species difference. J Med Chem 47:1617-30 (2004)  
Target
Name:
B2 bradykinin receptor
Synonyms:
B2 BRADYKININ B2R BK-2 receptor BKRB2_HUMAN | Bradykinin B2 receptor
Type:
Enzyme Catalytic Domain
Mol. Mass.:
44467.17
Organism:
Homo sapiens (Human)
Description:
B2 BRADYKININ BDKRB2 HUMAN::P30411
Residue:
391
  
Inhibitor
Name:
BDBM50067311
Synonyms:
4-{(E)-2-[({[2,4-Dichloro-3-(2-methyl-quinazolin-8-yloxymethyl)-phenyl]-methyl-carbamoyl}-methyl)-carbamoyl]-vinyl}-N-methyl-benzamide | CHEMBL298463
Type:
Small organic molecule
Emp. Form.:
C30H27Cl2N5O4
Mol. Mass.:
592.472
SMILES:
CNC(=O)c1ccc(\C=C\C(=O)NCC(=O)N(C)c2ccc(Cl)c(COc3cccc4cnc(C)nc34)c2Cl)cc1
: