Target
Sodium-dependent serotonin transporter
Ligand
BDBM50143000
Substrate
Meas. Tech.
ChEMBL_201221 (CHEMBL801197)
Ki
233±n/a nM
Citation
 Xu, LKulkarni, SSIzenwasser, SKatz, JLKopajtic, TLomenzo, SANewman, AHTrudell, ML Synthesis and monoamine transporter binding of 2-(diarylmethoxymethyl)-3 beta-aryltropane derivatives. J Med Chem 47:1676-82 (2004)  
Target
Name:
Sodium-dependent serotonin transporter
Synonyms:
5-HT Transporter 5HT transporter Anandamid membrane transporter, AMT Monoamine transporters; Norepinephrine & serotonin Slc6a4 Sodium-dependent serotonin transporter (SERT) | imipramine receptor
Type:
Multi-pass membrane protein
Mol. Mass.:
70168.43
Organism:
Rattus norvegicus (rat)
Description:
P31652
Residue:
630
  
Inhibitor
Name:
BDBM50143000
Synonyms:
(S)-2-[Bis-(4-fluoro-phenyl)-methoxymethyl]-8-methyl-3-p-tolyl-8-aza-bicyclo[3.2.1]octane; hydrochloride | CHEMBL539254
Type:
Small organic molecule
Emp. Form.:
C29H31F2NO
Mol. Mass.:
447.5593
SMILES:
CN1C2CCC1[C@@H](COC(c1ccc(F)cc1)c1ccc(F)cc1)C(C2)c1ccc(C)cc1
: