Target
Sodium-dependent dopamine transporter
Ligand
BDBM50143000
Substrate
Meas. Tech.
ChEMBL_61351 (CHEMBL673253)
Ki
62±n/a nM
Citation
 Xu, LKulkarni, SSIzenwasser, SKatz, JLKopajtic, TLomenzo, SANewman, AHTrudell, ML Synthesis and monoamine transporter binding of 2-(diarylmethoxymethyl)-3 beta-aryltropane derivatives. J Med Chem 47:1676-82 (2004)  
Target
Name:
Sodium-dependent dopamine transporter
Synonyms:
DA transporter SC6A3_RAT Sodium-dependent dopamine transporter | Sodium-dependent dopamine transporter (DAT)
Type:
Multi-pass membrane protein
Mol. Mass.:
68749.45
Organism:
Rattus norvegicus (rat)
Description:
P23977
Residue:
619
  
Inhibitor
Name:
BDBM50143000
Synonyms:
(S)-2-[Bis-(4-fluoro-phenyl)-methoxymethyl]-8-methyl-3-p-tolyl-8-aza-bicyclo[3.2.1]octane; hydrochloride | CHEMBL539254
Type:
Small organic molecule
Emp. Form.:
C29H31F2NO
Mol. Mass.:
447.5593
SMILES:
CN1C2CCC1[C@@H](COC(c1ccc(F)cc1)c1ccc(F)cc1)C(C2)c1ccc(C)cc1
: