Target
Transporter
Ligand
BDBM50143000
Substrate
Meas. Tech.
ChEMBL_142795 (CHEMBL751368)
Ki
1830±n/a nM
Citation
 Xu, LKulkarni, SSIzenwasser, SKatz, JLKopajtic, TLomenzo, SANewman, AHTrudell, ML Synthesis and monoamine transporter binding of 2-(diarylmethoxymethyl)-3 beta-aryltropane derivatives. J Med Chem 47:1676-82 (2004)  
Target
Name:
Transporter
Synonyms:
Monoamine transporters; Norepininephrine & dopamine | Norepinephrine Monoamine transporters
Type:
PROTEIN
Mol. Mass.:
66787.87
Organism:
Rattus norvegicus
Description:
ChEMBL_1463061
Residue:
597
  
Inhibitor
Name:
BDBM50143000
Synonyms:
(S)-2-[Bis-(4-fluoro-phenyl)-methoxymethyl]-8-methyl-3-p-tolyl-8-aza-bicyclo[3.2.1]octane; hydrochloride | CHEMBL539254
Type:
Small organic molecule
Emp. Form.:
C29H31F2NO
Mol. Mass.:
447.5593
SMILES:
CN1C2CCC1[C@@H](COC(c1ccc(F)cc1)c1ccc(F)cc1)C(C2)c1ccc(C)cc1
: