Target
Fibroblast growth factor 1
Ligand
BDBM50422561
Substrate
Meas. Tech.
ChEMBL_70628 (CHEMBL678684)
Kd
7.8±n/a nM
Citation
 Bytheway, ICochran, S Validation of molecular docking calculations involving FGF-1 and FGF-2. J Med Chem 47:1683-93 (2004)  
Target
Name:
Fibroblast growth factor 1
Synonyms:
Acidic fibroblast growth factor ECGF-beta FGF1_HUMAN Fibroblast growth factor 1 (FGF-1) Heparin-binding growth factor 1 | aFGF
Type:
Protein
Mol. Mass.:
17461.01
Organism:
Homo sapiens (Human)
Description:
P05230
Residue:
155
  
Inhibitor
Name:
BDBM50422561
Synonyms:
CHEMBL2303816
Type:
Small organic molecule
Emp. Form.:
C18H32O48S11
Mol. Mass.:
1369.133
SMILES:
OS(=O)(=O)OC[C@@H]1O[C@H](O[C@@H]2[C@@H](OS(O)(=O)=O)C(O[C@H]3[C@@H](OS(O)(=O)=O)O[C@@H](COS(O)(=O)=O)[C@@H](OS(O)(=O)=O)[C@@H]3OS(O)(=O)=O)O[C@@H](COS(O)(=O)=O)[C@H]2S(O)(=O)=O)[C@H](OS(O)(=O)=O)[C@@H](OS(O)(=O)=O)[C@@H]1OS(O)(=O)=O
: