Target
Thymidine kinase, cytosolic
Ligand
BDBM50366681
Substrate
Meas. Tech.
ChEMBL_208002 (CHEMBL816084)
Ki
100±n/a nM
Citation
 Russ, PSchelling, PScapozza, LFolkers, GClercq, EDMarquez, VE Synthesis and biological evaluation of 5-substituted derivatives of the potent antiherpes agent (north)-methanocarbathymine. J Med Chem 46:5045-54 (2003)  
Target
Name:
Thymidine kinase, cytosolic
Synonyms:
KITH_HUMAN | TK1
Type:
PROTEIN
Mol. Mass.:
25476.50
Organism:
Homo sapiens (Human)
Description:
ChEMBL_1333884
Residue:
234
  
Inhibitor
Name:
BDBM50366681
Synonyms:
BRIVUDINE Bridic Brivudin Helpin Zonavir | Zostex
Type:
Small organic molecule
Emp. Form.:
C11H13BrN2O5
Mol. Mass.:
333.135
SMILES:
OC[C@H]1O[C@H](C[C@@H]1O)n1cc(C=CBr)c(=O)[nH]c1=O
: