Target
S-methyl-5'-thioadenosine phosphorylase
Ligand
BDBM36496
Substrate
Meas. Tech.
ChEMBL_236 (CHEMBL615268)
Ki
0.166±n/a nM
Citation
 Evans, GBFurneaux, RHSchramm, VLSingh, VTyler, PC Targeting the polyamine pathway with transition-state analogue inhibitors of 5'-methylthioadenosine phosphorylase. J Med Chem 47:3275-81 (2004)  
Target
Name:
S-methyl-5'-thioadenosine phosphorylase
Synonyms:
5'-Methylthioadenosine phosphorylase (MTAP) MTA phosphorylase MTAP_HUMAN Methylthioadenosine Phosphorylase (MTAP) | S-methyl-5 -thioadenosine phosphorylase
Type:
Enzyme
Mol. Mass.:
31239.23
Organism:
Homo sapiens (Human)
Description:
Residue:
283
  
Inhibitor
Name:
BDBM36496
Synonyms:
CHEMBL552894 | ImmA-pClPh
Type:
Small organic molecule
Emp. Form.:
C17H18ClN5O2S
Mol. Mass.:
391.875
SMILES:
Nc1ncnc2c(c[nH]c12)C1NC(CSc2ccc(Cl)cc2)C(O)C1O
: