Target
S-methyl-5'-thioadenosine phosphorylase
Ligand
BDBM50140797
Substrate
Meas. Tech.
ChEMBL_236 (CHEMBL615268)
Ki
1±n/a nM
Citation
 Evans, GBFurneaux, RHSchramm, VLSingh, VTyler, PC Targeting the polyamine pathway with transition-state analogue inhibitors of 5'-methylthioadenosine phosphorylase. J Med Chem 47:3275-81 (2004)  
Target
Name:
S-methyl-5'-thioadenosine phosphorylase
Synonyms:
5'-Methylthioadenosine phosphorylase (MTAP) MTA phosphorylase MTAP_HUMAN Methylthioadenosine Phosphorylase (MTAP) | S-methyl-5 -thioadenosine phosphorylase
Type:
Enzyme
Mol. Mass.:
31239.23
Organism:
Homo sapiens (Human)
Description:
Residue:
283
  
Inhibitor
Name:
BDBM50140797
Synonyms:
(2S,3S,4R,5S)-2-(4-Amino-5H-pyrrolo[3,2-d]pyrimidin-7-yl)-5-methylsulfanylmethyl-pyrrolidine-3,4-diol; hydrochloride | CHEMBL554896
Type:
Small organic molecule
Emp. Form.:
C12H17N5O2S
Mol. Mass.:
295.361
SMILES:
CSC[C@H]1N[C@H]([C@H](O)[C@@H]1O)c1c[nH]c2c(N)ncnc12
: