Target
S-methyl-5'-thioadenosine phosphorylase
Ligand
BDBM36494
Substrate
Meas. Tech.
ChEMBL_236 (CHEMBL615268)
Ki
0.266±n/a nM
Citation
 Evans, GBFurneaux, RHSchramm, VLSingh, VTyler, PC Targeting the polyamine pathway with transition-state analogue inhibitors of 5'-methylthioadenosine phosphorylase. J Med Chem 47:3275-81 (2004)  
Target
Name:
S-methyl-5'-thioadenosine phosphorylase
Synonyms:
5'-Methylthioadenosine phosphorylase (MTAP) MTA phosphorylase MTAP_HUMAN Methylthioadenosine Phosphorylase (MTAP) | S-methyl-5 -thioadenosine phosphorylase
Type:
Enzyme
Mol. Mass.:
31239.23
Organism:
Homo sapiens (Human)
Description:
Residue:
283
  
Inhibitor
Name:
BDBM36494
Synonyms:
CHEMBL554965 | ImmA-Et
Type:
Small organic molecule
Emp. Form.:
C13H19N5O2S
Mol. Mass.:
309.387
SMILES:
CCSCC1NC(C(O)C1O)c1c[nH]c2c(N)ncnc12
: