Target
Nitric oxide synthase, brain
Ligand
BDBM50150889
Substrate
Meas. Tech.
ChEMBL_305342 (CHEMBL833562)
IC50
810±n/a nM
Citation
 Nason, DMHeck, SDBodenstein, MSLowe, JANelson, RBListon, DRNolan, CELanyon, LFWard, KMVolkmann, RA Substituted 6-phenyl-pyridin-2-ylamines: selective and potent inhibitors of neuronal nitric oxide synthase. Bioorg Med Chem Lett 14:4511-4 (2004)  
Target
Name:
Nitric oxide synthase, brain
Synonyms:
Constitutive NOS NC-NOS NOS type I nNOS NOS1_HUMAN Neuronal nitric oxide synthase Nitric oxide synthase, neuronal (nNOS) bNOS | nNOS
Type:
Homodimer
Mol. Mass.:
160985.98
Organism:
Homo sapiens (Human)
Description:
P29475
Residue:
1434
  
Inhibitor
Name:
BDBM50150889
Synonyms:
6-(4-Dimethylaminomethyl-2,5-dimethoxy-phenyl)-pyridin-2-ylamine | CHEMBL360626
Type:
Small organic molecule
Emp. Form.:
C16H21N3O2
Mol. Mass.:
287.3568
SMILES:
COc1cc(c(OC)cc1CN(C)C)-c1cccc(N)n1
: