Target
Carbonic anhydrase
Ligand
BDBM50153977
Substrate
Meas. Tech.
ChEMBL_303052 (CHEMBL828021)
Ki
55700000±n/a nM
Citation
 Innocenti, AZimmerman, SFerry, JGScozzafava, ASupuran, CT Carbonic anhydrase inhibitors. Inhibition of the beta-class enzyme from the methanoarchaeon Methanobacterium thermoautotrophicum (Cab) with anions. Bioorg Med Chem Lett 14:4563-7 (2004)  
Target
Name:
Carbonic anhydrase
Synonyms:
Type:
PROTEIN
Mol. Mass.:
19556.84
Organism:
Methanobacterium thermoautotrophicum
Description:
ChEMBL_1280426
Residue:
176
  
Inhibitor
Name:
BDBM50153977
Synonyms:
CHEMBL186537 [NNNH] hydrido-1kappaH-trinitrogen(2N--N)hydrogen trinitride(1-) triazoic acid
Type:
Small organic molecule
Emp. Form.:
HN3
Mol. Mass.:
43.028
SMILES:
N=[N+]=[N-]
: