Target
Carbonic anhydrase 2
Ligand
BDBM50153977
Substrate
Meas. Tech.
ChEMBL_302421 (CHEMBL875204)
Ki
1500000±n/a nM
Citation
 Innocenti, AZimmerman, SFerry, JGScozzafava, ASupuran, CT Carbonic anhydrase inhibitors. Inhibition of the beta-class enzyme from the methanoarchaeon Methanobacterium thermoautotrophicum (Cab) with anions. Bioorg Med Chem Lett 14:4563-7 (2004)  
Target
Name:
Carbonic anhydrase 2
Synonyms:
CA-II CAC Carbonate dehydratase II Carbonic anhydrase 2 (CA-II) Carbonic anhydrase C Carbonic anhydrase II (CA-II) Carbonic anhydrase II (hCA II) | Carbonic anhydrase isoenzyme II (hCA II)
Type:
Enzyme
Mol. Mass.:
29250.71
Organism:
Homo sapiens (Human)
Description:
P00918
Residue:
260
  
Inhibitor
Name:
BDBM50153977
Synonyms:
CHEMBL186537 [NNNH] hydrido-1kappaH-trinitrogen(2N--N)hydrogen trinitride(1-) triazoic acid
Type:
Small organic molecule
Emp. Form.:
HN3
Mol. Mass.:
43.028
SMILES:
N=[N+]=[N-]
: