Target
Cytosolic beta-glucosidase
Ligand
BDBM50153478
Substrate
Meas. Tech.
ChEBML_305045
IC50
14000000000±n/a nM
Citation
 Ogawa, SFunayama, SOkazaki, KIshizuka, FSakata, YDoi, F Synthesis of 5a-carba-hexopyranoses and hexopyranosylamines, as well as 5a,5a'-dicarbadisaccharides, from 3,8-dioxatricyclo[4.2.1.0(2,4)]nonan-9-ol: glycosidase inhibitory activity of N-substituted 5a-carba-beta-gluco- and beta-galactopyranosylamines, and derivatives thereof. Bioorg Med Chem Lett 14:5183-8 (2004)  
Target
Name:
Cytosolic beta-glucosidase
Synonyms:
Beta-glucosidase cytosolic CBGL1 GBA3_HUMAN
Type:
PROTEIN
Mol. Mass.:
53687.94
Organism:
Homo sapiens (Human)
Description:
ChEMBL_820008
Residue:
469
  
Inhibitor
Name:
BDBM50153478
Synonyms:
CHEMBL185536 | N-(2,3,4-Trihydroxy-5-hydroxymethyl-cyclohexyl)-acetamide
Type:
Small organic molecule
Emp. Form.:
C9H17NO5
Mol. Mass.:
219.235
SMILES:
CC(=O)NC1CC(CO)C(O)C(O)C1O
: