Target
Carbonic anhydrase 9
Ligand
BDBM50153977
Substrate
Meas. Tech.
ChEMBL_302640 (CHEMBL839931)
Ki
5000±n/a nM
Citation
 Innocenti, AFirnges, MAAntel, JWurl, MScozzafava, ASupuran, CT Carbonic anhydrase inhibitors: inhibition of the membrane-bound human isozyme IV with anions. Bioorg Med Chem Lett 14:5769-73 (2004)  
Target
Name:
Carbonic anhydrase 9
Synonyms:
CA-IX CAH9_HUMAN Carbonic anhydrase 9 (CA IX) Carbonic anhydrase 9 precursor Carbonic anhydrase IX (CAIX) Carbonic anhydrases; II & IX MN RCC-associated antigen G250
Type:
Enzyme
Mol. Mass.:
49669.03
Organism:
Homo sapiens (Human)
Description:
Catalytic domain of human cloned isozyme was used in the assay
Residue:
459
  
Inhibitor
Name:
BDBM50153977
Synonyms:
CHEMBL186537 [NNNH] hydrido-1kappaH-trinitrogen(2N--N)hydrogen trinitride(1-) triazoic acid
Type:
Small organic molecule
Emp. Form.:
HN3
Mol. Mass.:
43.028
SMILES:
N=[N+]=[N-]
: