Target
Carbonic anhydrase 2
Ligand
BDBM50155550
Substrate
Meas. Tech.
ChEMBL_302867 (CHEMBL828782)
Ki
12±n/a nM
Citation
 Chazalette, CMasereel, BRolin, SThiry, AScozzafava, AInnocenti, ASupuran, CT Carbonic anhydrase inhibitors. Design of anticonvulsant sulfonamides incorporating indane moieties. Bioorg Med Chem Lett 14:5781-6 (2004)  
Target
Name:
Carbonic anhydrase 2
Synonyms:
CA-II CAC Carbonate dehydratase II Carbonic anhydrase 2 (CA-II) Carbonic anhydrase C Carbonic anhydrase II (CA-II) Carbonic anhydrase II (hCA II) | Carbonic anhydrase isoenzyme II (hCA II)
Type:
Enzyme
Mol. Mass.:
29250.71
Organism:
Homo sapiens (Human)
Description:
P00918
Residue:
260
  
Inhibitor
Name:
BDBM50155550
Synonyms:
2,3,5,6-Tetrafluoro-N-(5-sulfamoyl-indan-2-yl)-benzamide CHEMBL186963
Type:
Small organic molecule
Emp. Form.:
C16H12F4N2O3S
Mol. Mass.:
388.337
SMILES:
NS(=O)(=O)c1ccc2CC(Cc2c1)NC(=O)c1c(F)c(F)cc(F)c1F
: