Target
Peroxisome proliferator-activated receptor alpha
Ligand
BDBM50145714
Substrate
Meas. Tech.
ChEMBL_304229 (CHEMBL828944)
EC50
69±n/a nM
Citation
 Wang, MWinneroski, LLArdecky, RJBabine, REBrooks, DAEtgen, GJHutchison, DRKauffman, RFKunkel, AMais, DEMontrose-Rafizadeh, COgilvie, KMOldham, BAPeters, MKRito, CJRungta, DKTripp, AEWilson, SBXu, YZink, RWMcCarthy, JR Conversion of human-selective PPARalpha agonists to human/mouse dual agonists: a molecular modeling analysis. Bioorg Med Chem Lett 14:6113-6 (2004)  
Target
Name:
Peroxisome proliferator-activated receptor alpha
Synonyms:
NR1C1 PPAR PPAR-alpha PPARA_HUMAN Peroxisome proliferator-activated receptor | Peroxisome proliferator-activated receptor alpha (PPAR alpha)
Type:
Enzyme
Mol. Mass.:
52222.08
Organism:
Homo sapiens (Human)
Description:
Q07869
Residue:
468
  
Inhibitor
Name:
BDBM50145714
Synonyms:
3-{4-[2-(2-Biphenyl-4-yl-5-methyl-oxazol-4-yl)-ethoxy]-phenyl}-2-methyl-2-phenoxy-propionic acid | CHEMBL312717
Type:
Small organic molecule
Emp. Form.:
C34H31NO5
Mol. Mass.:
533.6136
SMILES:
Cc1oc(nc1CCOc1ccc(CC(C)(Oc2ccccc2)C(O)=O)cc1)-c1ccc(cc1)-c1ccccc1
: