Target
Carbonic anhydrase 14
Ligand
BDBM10864
Substrate
Meas. Tech.
ChEMBL_303797 (CHEMBL829846)
Ki
15±n/a nM
Citation
 Nishimori, IVullo, DInnocenti, AScozzafava, AMastrolorenzo, ASupuran, CT Carbonic anhydrase inhibitors: inhibition of the transmembrane isozyme XIV with sulfonamides. Bioorg Med Chem Lett 15:3828-33 (2005)  
Target
Name:
Carbonic anhydrase 14
Synonyms:
CA-XIV CAH14_HUMAN Carbonic Anhydrase XIV Carbonic anhydrase 14 Carbonic anhydrase XIV (CA XIV)
Type:
Enzyme
Mol. Mass.:
37665.67
Organism:
Homo sapiens (Human)
Description:
Human (cloned) isozyme.
Residue:
337
  
Inhibitor
Name:
BDBM10864
Synonyms:
4-Amino-3-bromobenzenesulfonamide CHEMBL6724 halogenosulfanilamide deriv. 5d
Type:
Small organic molecule
Emp. Form.:
C6H7BrN2O2S
Mol. Mass.:
251.101
SMILES:
Nc1ccc(cc1Br)S(N)(=O)=O
: