Target
Prostaglandin E2 receptor EP3 subtype
Ligand
BDBM50159762
Substrate
Meas. Tech.
ChEMBL_302796 (CHEMBL839480)
Ki
7±n/a nM
Citation
 Belley, MGallant, MRoy, BHoude, KLachance, NLabelle, MTrimble, LAChauret, NLi, CSawyer, NTremblay, NLamontagne, SCarrière, MCDenis, DGreig, GMSlipetz, DMetters, KMGordon, RChan, CCZamboni, RJ Structure-activity relationship studies on ortho-substituted cinnamic acids, a new class of selective EP(3) antagonists. Bioorg Med Chem Lett 15:527-30 (2005)  
Target
Name:
Prostaglandin E2 receptor EP3 subtype
Synonyms:
PE2R3_HUMAN PGE2-R Prostaglandin E2 receptor Prostaglandin E2 receptor EP3 subtype (EP3) Prostaglandin E2 receptor EP3D subtype (EP3D) | Prostanoid EP3 receptor
Type:
Enzyme
Mol. Mass.:
43335.03
Organism:
Homo sapiens (Human)
Description:
P43115
Residue:
390
  
Inhibitor
Name:
BDBM50159762
Synonyms:
(E)-3-(2-{(E)-3-[2-(4-Fluoro-benzyloxy)-3-methyl-phenyl]-allyl}-phenyl)-acrylic acid | CHEMBL180089
Type:
Small organic molecule
Emp. Form.:
C26H23FO3
Mol. Mass.:
402.4574
SMILES:
Cc1cccc(\C=C\Cc2ccccc2\C=C\C(O)=O)c1OCc1ccc(F)cc1
: