Target
Equilibrative nucleoside transporter 1
Ligand
BDBM50370560
Substrate
Meas. Tech.
ChEMBL_303651 (CHEMBL828999)
Ki
0.64±n/a nM
Citation
 Tromp, RASpanjersberg, RFvon Frijtag Drabbe Künzel, JKIJzerman, AP Inhibition of nucleoside transport proteins by C8-alkylamine-substituted purines. J Med Chem 48:321-9 (2005)  
Target
Name:
Equilibrative nucleoside transporter 1
Synonyms:
ENT1 Equilibrative Nucleoside Transporter 1 (ENT1) Equilibrative nucleoside transporter 1 S29A1_HUMAN Solute carrier family 29 member 1
Type:
Multi-pass membrane protein
Mol. Mass.:
50225.92
Organism:
Homo sapiens (Human)
Description:
Residue:
456
  
Inhibitor
Name:
BDBM50370560
Synonyms:
CHEMBL610234
Type:
Small organic molecule
Emp. Form.:
C22H27N5O4S
Mol. Mass.:
457.546
SMILES:
OC[C@H]1OC([C@H](O)[C@@H]1O)n1c(NC2CCCC2)nc2c(SCc3ccccc3)ncnc12
: