Target
Type-2 angiotensin II receptor
Ligand
BDBM50168423
Substrate
Meas. Tech.
ChEMBL_303241 (CHEMBL827206)
Ki
9.30±n/a nM
Citation
 Rosenström, USköld, CPlouffe, BBeaudry, HLindeberg, GBotros, MNyberg, FWolf, GKarlén, AGallo-Payet, NHallberg, A New selective AT2 receptor ligands encompassing a gamma-turn mimetic replacing the amino acid residues 4-5 of angiotensin II act as agonists. J Med Chem 48:4009-24 (2005)  
Target
Name:
Type-2 angiotensin II receptor
Synonyms:
AGTR2 AT2 Angiotensin II type 2 (AT-2) receptor Type-2 angiotensin II receptor
Type:
Enzyme Catalytic Domain
Mol. Mass.:
41201.61
Organism:
Homo sapiens (Human)
Description:
Angiotensin II, central 0 0::P50052
Residue:
363
  
Inhibitor
Name:
BDBM50168423
Synonyms:
(3S)-3-amino-3-{[(1S)-1-{[(1S)-1-{[(2S)-4-({[(2S)-1-[(2S)-2-{[(1S)-1-carboxy-2-phenylethyl]carbamoyl}pyrrolidin-1-yl]-3-(1H-imidazol-4-yl)-1-oxopropan-2-yl]carbamoyl}methyl)-2-[(4-hydroxyphenyl)methyl]-3-oxo-2,3,4,5-tetrahydro-1H-1,4-benzodiazepin-9-yl]carbamoyl}-2-methylpropyl]carbamoyl}ethyl]carbamoyl}propanoic acid | CHEMBL406907
Type:
Small organic molecule
Emp. Form.:
C50H61N11O12
Mol. Mass.:
1008.0858
SMILES:
CC(C)[C@H](NC(=O)[C@H](C)NC(=O)[C@@H](N)CC(O)=O)C(=O)Nc1cccc2CN(CC(=O)N[C@@H](Cc3cnc[nH]3)C(=O)N3CCC[C@H]3C(=O)N[C@@H](Cc3ccccc3)C(O)=O)C(=O)[C@H](Cc3ccc(O)cc3)Nc12
: