Target
Somatostatin receptor type 2
Ligand
BDBM50370579
Substrate
Meas. Tech.
ChEMBL_302670 (CHEMBL839014)
Ki
>1000±n/a nM
Citation
 Neelamkavil, SArison, BBirzin, EFeng, JJChen, KHLin, ACheng, FCTaylor, LThornton, ERSmith, ABHirschmann, R Replacement of Phe6, Phe7, and Phe11 of D-Trp8-somatostatin-14 with L-pyrazinylalanine. Predicted and observed effects on binding affinities at hSST2 and hSST4. An unexpected effect of the chirality of Trp8 on NMR spectra in methanol. J Med Chem 48:4025-30 (2005)  
Target
Name:
Somatostatin receptor type 2
Synonyms:
SOMATOSTATIN SST2 SS-2-R SS2R SSTR2 | Somatostatin receptor type 2 (SSTR2)
Type:
Enzyme
Mol. Mass.:
41344.94
Organism:
Homo sapiens (Human)
Description:
P30874
Residue:
369
  
Inhibitor
Name:
BDBM50370579
Synonyms:
CHEMBL1791305
Type:
Small organic molecule
Emp. Form.:
C74H102N20O19S2
Mol. Mass.:
1639.854
SMILES:
C[C@H](O)[C@H]1NC(=O)[C@H](Cc2ccccc2)NC(=O)[C@H](NC(=O)[C@@H](CCCCN)NC(=O)[C@H](Cc2c[nH]c3ccccc23)NC(=O)[C@@H](Cc2cnccn2)NC(=O)[C@H](Cc2ccccc2)NC(=O)[C@@H](CC(N)=O)NC(=O)[C@H](CCCCN)NC(=O)[C@H](CSSC[C@H](NC(=O)[C@H](CO)NC1=O)C(O)=O)NC(=O)CNC(=O)[C@H](C)N)[C@H](C)O
: