Target
Somatostatin receptor type 4
Ligand
BDBM50370581
Substrate
Meas. Tech.
ChEMBL_302671 (CHEMBL839434)
Ki
80±n/a nM
Citation
 Neelamkavil, SArison, BBirzin, EFeng, JJChen, KHLin, ACheng, FCTaylor, LThornton, ERSmith, ABHirschmann, R Replacement of Phe6, Phe7, and Phe11 of D-Trp8-somatostatin-14 with L-pyrazinylalanine. Predicted and observed effects on binding affinities at hSST2 and hSST4. An unexpected effect of the chirality of Trp8 on NMR spectra in methanol. J Med Chem 48:4025-30 (2005)  
Target
Name:
Somatostatin receptor type 4
Synonyms:
SOMATOSTATIN SST4 SS4-R SSR4_HUMAN SSTR4 | Somatostatin receptor type 4 (SSTR4)
Type:
Enzyme
Mol. Mass.:
42015.38
Organism:
Homo sapiens (Human)
Description:
P31391
Residue:
388
  
Inhibitor
Name:
BDBM50370581
Synonyms:
CHEMBL1791310
Type:
Small organic molecule
Emp. Form.:
C70H101N19O18S2
Mol. Mass.:
1560.797
SMILES:
CC(O)[C@H]1NC(=O)[C@@H](CCCCN)NC(=O)[C@H](Cc2c[nH]c3ccccc23)NC(=O)[C@@H](Cc2ccccc2)NC(=O)[C@H](C)NC(=O)[C@@H](CC(N)=O)NC(=O)[C@H](CCCCN)NC(=O)[C@H](CSSC[C@H](NC(=O)[C@H](CO)NC(=O)[C@H](NC(=O)[C@H](Cc2ccccc2)NC1=O)[C@H](C)O)C(N)=O)NC(=O)CNC(=O)[C@H](C)N
: