Target
3-beta-hydroxysteroid-Delta(8),Delta(7)-isomerase
Ligand
BDBM50010618
Substrate
Meas. Tech.
ChEMBL_303691 (CHEMBL829736)
Ki
2200±n/a nM
Citation
 Laggner, CSchieferer, CFiechtner, BPoles, GHoffmann, RDGlossmann, HLanger, TMoebius, FF Discovery of high-affinity ligands of sigma1 receptor, ERG2, and emopamil binding protein by pharmacophore modeling and virtual screening. J Med Chem 48:4754-64 (2005)  
Target
Name:
3-beta-hydroxysteroid-Delta(8),Delta(7)-isomerase
Synonyms:
3-beta-hydroxysteroid-Delta(8),Delta(7)-isomerase/Delta(24)-sterol reductase Anti-estrogen binding site (AEBS) D8-D7 sterol isomerase EBP Emopamil-binding protein
Type:
PROTEIN
Mol. Mass.:
26358.51
Organism:
Homo sapiens (Human)
Description:
ChEMBL_873432
Residue:
230
  
Inhibitor
Name:
BDBM50010618
Synonyms:
(+)-3-(1-Propyl-piperidin-3-yl)-phenol 3-(1-Propyl-piperidin-3-yl)-phenol CHEMBL7393 | cid_202478
Type:
Small organic molecule
Emp. Form.:
C14H21NO
Mol. Mass.:
219.3226
SMILES:
CCCN1CCC[C@@H](C1)c1cccc(O)c1
: