Target
Prolyl endopeptidase
Ligand
BDBM50051547
Substrate
Meas. Tech.
ChEMBL_306908 (CHEMBL828351)
pH
7±n/a
IC50
29±n/a nM
Comments
extracted
Citation
 Jarho, EMWallén, EAChristiaans, JAForsberg, MMVenäläinen, JIMännistö, PTGynther, JPoso, A Dicarboxylic acid azacycle l-prolyl-pyrrolidine amides as prolyl oligopeptidase inhibitors and three-dimensional quantitative structure-activity relationship of the enzyme-inhibitor interactions. J Med Chem 48:4772-82 (2005)  
Target
Name:
Prolyl endopeptidase
Synonyms:
3.4.21.26 PPCE_PIG Post-proline cleaving enzyme
Type:
Mol. Mass.:
80758.04
Organism:
Sus scrofa
Description:
Residue:
710
  
Inhibitor
Name:
BDBM50051547
Synonyms:
(S)-2-(Pyrrolidine-1-carbonyl)-pyrrolidine-1-carboxylic acid tert-butyl ester CHEMBL311364
Type:
Small organic molecule
Emp. Form.:
C14H24N2O3
Mol. Mass.:
268.352
SMILES:
CC(C)(C)OC(=O)N1CCC[C@H]1C(=O)N1CCCC1
: