Target
Adenosine deaminase
Ligand
BDBM50171387
Substrate
Meas. Tech.
ChEMBL_302877 (CHEMBL828791)
Ki
530±n/a nM
Citation
 Da Settimo, FPrimofiore, GLa Motta, CTaliani, SSimorini, FMarini, AMMugnaini, LLavecchia, ANovellino, ETuscano, DMartini, C Novel, highly potent adenosine deaminase inhibitors containing the pyrazolo[3,4-d]pyrimidine ring system. Synthesis, structure-activity relationships, and molecular modeling studies. J Med Chem 48:5162-74 (2005)  
Target
Name:
Adenosine deaminase
Synonyms:
ADA Adenosine aminohydrolase
Type:
Enzyme
Mol. Mass.:
40910.44
Organism:
Bos taurus (bovine)
Description:
Residue:
363
  
Inhibitor
Name:
BDBM50171387
Synonyms:
2-Octyl-2H-pyrazolo[3,4-d]pyrimidin-4-ylamine | CHEMBL364717
Type:
Small organic molecule
Emp. Form.:
C13H21N5
Mol. Mass.:
247.3393
SMILES:
CCCCCCCCn1cc2c(N)ncnc2n1
: