Target
5-hydroxytryptamine receptor 6
Ligand
BDBM50159177
Substrate
Meas. Tech.
ChEMBL_303674 (CHEMBL830434)
Ki
8±n/a nM
Citation
 Cole, DCLennox, WJLombardi, SEllingboe, JWBernotas, RCTawa, GJMazandarani, HSmith, DLZhang, GCoupet, JSchechter, LE Discovery of 5-arylsulfonamido-3-(pyrrolidin-2-ylmethyl)-1H-indole derivatives as potent, selective 5-HT6 receptor agonists and antagonists. J Med Chem 48:353-6 (2005)  
Target
Name:
5-hydroxytryptamine receptor 6
Synonyms:
5-HT-6 5-hydroxytryptamine receptor 6 (5-HT-6) 5-hydroxytryptamine receptor 6 (5HT6) HTR6 Serotonin 6 (5-HT6) receptor | Serotonin Receptor 6
Type:
G Protein-Coupled Receptor (GPCR)
Mol. Mass.:
46968.43
Organism:
Homo sapiens (Human)
Description:
P50406
Residue:
440
  
Inhibitor
Name:
BDBM50159177
Synonyms:
2,4-Difluoro-N-(3-(R)-1-pyrrolidin-2-ylmethyl-1H-indol-5-yl)-benzenesulfonamide | 2,4-Difluoro-N-(3-(S)-1-pyrrolidin-2-ylmethyl-1H-indol-5-yl)-benzenesulfonamide
Type:
Small organic molecule
Emp. Form.:
C19H19F2N3O2S
Mol. Mass.:
391.435
SMILES:
Fc1ccc(c(F)c1)S(=O)(=O)Nc1ccc2[nH]cc(CC3CCCN3)c2c1
: