Target
5-hydroxytryptamine receptor 6
Ligand
BDBM50159176
Substrate
Meas. Tech.
ChEMBL_303674 (CHEMBL830434)
Ki
5±n/a nM
Citation
 Cole, DCLennox, WJLombardi, SEllingboe, JWBernotas, RCTawa, GJMazandarani, HSmith, DLZhang, GCoupet, JSchechter, LE Discovery of 5-arylsulfonamido-3-(pyrrolidin-2-ylmethyl)-1H-indole derivatives as potent, selective 5-HT6 receptor agonists and antagonists. J Med Chem 48:353-6 (2005)  
Target
Name:
5-hydroxytryptamine receptor 6
Synonyms:
5-HT-6 5-hydroxytryptamine receptor 6 (5-HT-6) 5-hydroxytryptamine receptor 6 (5HT6) HTR6 Serotonin 6 (5-HT6) receptor | Serotonin Receptor 6
Type:
G Protein-Coupled Receptor (GPCR)
Mol. Mass.:
46968.43
Organism:
Homo sapiens (Human)
Description:
P50406
Residue:
440
  
Inhibitor
Name:
BDBM50159176
Synonyms:
2-Bromo-N-[3-((S)-1-methyl-pyrrolidin-2-ylmethyl)-1H-indol-5-yl]-benzenesulfonamide
Type:
Small organic molecule
Emp. Form.:
C20H22BrN3O2S
Mol. Mass.:
448.377
SMILES:
CN1CCCC1Cc1c[nH]c2ccc(NS(=O)(=O)c3ccccc3Br)cc12
: