Target
5-hydroxytryptamine receptor 6
Ligand
BDBM50159209
Substrate
Meas. Tech.
ChEMBL_303674 (CHEMBL830434)
Ki
1±n/a nM
Citation
 Cole, DCLennox, WJLombardi, SEllingboe, JWBernotas, RCTawa, GJMazandarani, HSmith, DLZhang, GCoupet, JSchechter, LE Discovery of 5-arylsulfonamido-3-(pyrrolidin-2-ylmethyl)-1H-indole derivatives as potent, selective 5-HT6 receptor agonists and antagonists. J Med Chem 48:353-6 (2005)  
Target
Name:
5-hydroxytryptamine receptor 6
Synonyms:
5-HT-6 5-hydroxytryptamine receptor 6 (5-HT-6) 5-hydroxytryptamine receptor 6 (5HT6) HTR6 Serotonin 6 (5-HT6) receptor | Serotonin Receptor 6
Type:
G Protein-Coupled Receptor (GPCR)
Mol. Mass.:
46968.43
Organism:
Homo sapiens (Human)
Description:
P50406
Residue:
440
  
Inhibitor
Name:
BDBM50159209
Synonyms:
3,5-Dimethyl-isoxazole-4-sulfonic acid [3-((R)-1-methyl-pyrrolidin-2-ylmethyl)-1H-indol-5-yl]-amide
Type:
Small organic molecule
Emp. Form.:
C19H24N4O3S
Mol. Mass.:
388.484
SMILES:
CN1CCCC1Cc1c[nH]c2ccc(NS(=O)(=O)c3c(C)noc3C)cc12
: