Target
Cytochrome P450 2A6
Ligand
BDBM60953
Substrate
Meas. Tech.
ChEMBL_305266 (CHEMBL832816)
IC50
3920±n/a nM
Citation
 Rahnasto, MRaunio, HPoso, AWittekindt, CJuvonen, RO Quantitative structure-activity relationship analysis of inhibitors of the nicotine metabolizing CYP2A6 enzyme. J Med Chem 48:440-9 (2005)  
Target
Name:
Cytochrome P450 2A6
Synonyms:
1,4-cineole 2-exo-monooxygenase CP2A6_HUMAN CYP2A6 Coumarin 7-hydroxylase Cytochrome P450 IIA3 | Cytochrome P450(I)
Type:
Protein
Mol. Mass.:
56514.34
Organism:
Homo sapiens (Human)
Description:
P11509
Residue:
494
  
Inhibitor
Name:
BDBM60953
Synonyms:
BDBM50139371 | benzaldehyde
Type:
Emp. Form.:
C7H6O
Mol. Mass.:
106.1219
SMILES:
O=Cc1ccccc1
: