Target
Cytidine deaminase
Ligand
BDBM50421666
Substrate
Meas. Tech.
ChEMBL_302817 (CHEMBL839507)
Ki
400±n/a nM
Citation
 Chung, SJFromme, JCVerdine, GL Structure of human cytidine deaminase bound to a potent inhibitor. J Med Chem 48:658-60 (2005)  
Target
Name:
Cytidine deaminase
Synonyms:
CDA CDD_HUMAN Cytidine deaminase (CDA)
Type:
Ezyme
Mol. Mass.:
16185.04
Organism:
Homo sapiens (Human)
Description:
P32320
Residue:
146
  
Inhibitor
Name:
BDBM50421666
Synonyms:
CHEMBL2311128 | US9040501, 876404
Type:
Small organic molecule
Emp. Form.:
C9H16N2O6
Mol. Mass.:
248.2331
SMILES:
OC[C@H]1O[C@H]([C@H](O)[C@@H]1O)N1CCC(O)NC1=O
: