Target
Sodium-dependent serotonin transporter
Ligand
BDBM50083536
Substrate
Meas. Tech.
ChEMBL_302731 (CHEMBL838679)
Ki
18.70±n/a nM
Citation
 Lomenzo, SARhoden, JBIzenwasser, SWade, DKopajtic, TKatz, JLTrudell, ML Synthesis and biological evaluation of meperidine analogues at monoamine transporters. J Med Chem 48:1336-43 (2005)  
Target
Name:
Sodium-dependent serotonin transporter
Synonyms:
5-HT Transporter 5HT transporter Anandamid membrane transporter, AMT Monoamine transporters; Norepinephrine & serotonin Slc6a4 Sodium-dependent serotonin transporter (SERT) | imipramine receptor
Type:
Multi-pass membrane protein
Mol. Mass.:
70168.43
Organism:
Rattus norvegicus (rat)
Description:
P31652
Residue:
630
  
Inhibitor
Name:
BDBM50083536
Synonyms:
4-(3,4-Dichloro-phenyl)-1-methyl-piperidine-4-carboxylic acid ethyl ester CHEMBL541124
Type:
Small organic molecule
Emp. Form.:
C15H19Cl2NO2
Mol. Mass.:
316.223
SMILES:
CCOC(=O)C1(CCN(C)CC1)c1ccc(Cl)c(Cl)c1
: