Target
Cannabinoid receptor 2
Ligand
BDBM50163123
Substrate
Meas. Tech.
ChEMBL_303194 (CHEMBL829820)
Ki
208±n/a nM
Citation
 Lange, JHvan Stuivenberg, HHCoolen, HKAdolfs, TJMcCreary, ACKeizer, HGWals, HCVeerman, WBorst, AJde Looff, WVerveer, PCKruse, CG Bioisosteric replacements of the pyrazole moiety of rimonabant: synthesis, biological properties, and molecular modeling investigations of thiazoles, triazoles, and imidazoles as potent and selective CB1 cannabinoid receptor antagonists. J Med Chem 48:1823-38 (2005)  
Target
Name:
Cannabinoid receptor 2
Synonyms:
CANNABINOID CB2 CB2 CB2B CNR2_HUMAN Cannabinoid CB2 receptor Cannabinoid receptor 2 (CB2R) | hCB2
Type:
G Protein-Coupled Receptor (GPCR)
Mol. Mass.:
39690.94
Organism:
Homo sapiens (Human)
Description:
P34972
Residue:
360
  
Inhibitor
Name:
BDBM50163123
Synonyms:
2-(4-Chloro-phenyl)-1-(2,4-dichloro-phenyl)-5-methyl-1H-imidazole-4-carboxylic acid piperidin-1-ylamide | CHEMBL439657
Type:
Small organic molecule
Emp. Form.:
C22H21Cl3N4O
Mol. Mass.:
463.787
SMILES:
Cc1c(nc(-c2ccc(Cl)cc2)n1-c1ccc(Cl)cc1Cl)C(=O)NN1CCCCC1
: