Target
Cannabinoid receptor 1
Ligand
BDBM50140220
Substrate
Meas. Tech.
ChEMBL_303193 (CHEMBL829819)
Ki
23±n/a nM
Citation
 Lange, JHvan Stuivenberg, HHCoolen, HKAdolfs, TJMcCreary, ACKeizer, HGWals, HCVeerman, WBorst, AJde Looff, WVerveer, PCKruse, CG Bioisosteric replacements of the pyrazole moiety of rimonabant: synthesis, biological properties, and molecular modeling investigations of thiazoles, triazoles, and imidazoles as potent and selective CB1 cannabinoid receptor antagonists. J Med Chem 48:1823-38 (2005)  
Target
Name:
Cannabinoid receptor 1
Synonyms:
CANN6 CB-R CNR CNR1_HUMAN Cannabinoid receptor Cannabinoid receptor 1 (brain)
Type:
G Protein-Coupled Receptor (GPCR)
Mol. Mass.:
52868.96
Organism:
Homo sapiens (Human)
Description:
P21554
Residue:
472
  
Inhibitor
Name:
BDBM50140220
Synonyms:
1-(4-Chloro-phenyl)-2-(2,4-dichloro-phenyl)-1H-imidazole-4-carboxylic acid piperidin-1-ylamide | CHEMBL15399
Type:
Small organic molecule
Emp. Form.:
C21H19Cl3N4O
Mol. Mass.:
449.761
SMILES:
Clc1ccc(cc1)-n1cc(nc1-c1ccc(Cl)cc1Cl)C(=O)NN1CCCCC1
: