Target
Androgen receptor
Ligand
BDBM50367916
Substrate
Meas. Tech.
ChEMBL_302159 (CHEMBL829227)
Kd
0.61±n/a nM
Citation
 Gilli, PGilli, GBorea, PAVarani, KScatturin, ADalpiaz, A Binding thermodynamics as a tool to investigate the mechanisms of drug-receptor interactions: thermodynamics of cytoplasmic steroid/nuclear receptors in comparison with membrane receptors. J Med Chem 48:2026-35 (2005)  
Target
Name:
Androgen receptor
Synonyms:
ANDR_HUMAN Androgen Receptor Androgen receptor/Baculoviral IAP repeat-containing protein 2 Dihydrotestosterone receptor Nuclear receptor subfamily 3 group C member 4
Type:
Receptor
Mol. Mass.:
99185.27
Organism:
Homo sapiens (Human)
Description:
CHO cells were stably transfected with human AR gene.
Residue:
920
  
Inhibitor
Name:
BDBM50367916
Synonyms:
METHYLTRIENOLONE R-1881
Type:
Small organic molecule
Emp. Form.:
C19H24O2
Mol. Mass.:
284.3927
SMILES:
C[C@]1(O)CC[C@H]2[C@@H]3CCC4=CC(=O)CCC4=C3C=C[C@]12C
: