Target
Tissue alpha-L-fucosidase
Ligand
BDBM50065259
Substrate
Meas. Tech.
ChEMBL_302337 (CHEMBL875195)
Ki
4700±n/a nM
Citation
 Kato, AKato, NKano, EAdachi, IIkeda, KYu, LOkamoto, TBanba, YOuchi, HTakahata, HAsano, N Biological properties of D- and L-1-deoxyazasugars. J Med Chem 48:2036-44 (2005)  
Target
Name:
Tissue alpha-L-fucosidase
Synonyms:
Alpha-L-fucosidase 1 FUCO_BOVIN
Type:
PROTEIN
Mol. Mass.:
54093.12
Organism:
Bos taurus
Description:
ChEMBL_335897
Residue:
468
  
Inhibitor
Name:
BDBM50065259
Synonyms:
(2R,3R,4R,5R)-2-(Hydroxymethyl)piperidine-3,4,5-triol, 11 (2R,3R,4R,5R)-2-Hydroxymethyl-piperidine-3,4,5-triol 2-HYDROXYMETHYL-PIPERIDINE-3,4,5-TRIOL deoxymannojirimycin
Type:
Small organic molecule
Emp. Form.:
C6H13NO4
Mol. Mass.:
163.1717
SMILES:
OC[C@H]1NC[C@@H](O)[C@@H](O)[C@@H]1O
: