Target
Tissue alpha-L-fucosidase
Ligand
BDBM50163439
Substrate
Meas. Tech.
ChEMBL_305123 (CHEMBL831591)
IC50
3500±n/a nM
Citation
 Kato, AKato, NKano, EAdachi, IIkeda, KYu, LOkamoto, TBanba, YOuchi, HTakahata, HAsano, N Biological properties of D- and L-1-deoxyazasugars. J Med Chem 48:2036-44 (2005)  
Target
Name:
Tissue alpha-L-fucosidase
Synonyms:
Alpha-L-fucosidase I FUCA1 Tissue alpha-L-fucosidase
Type:
PROTEIN
Mol. Mass.:
53690.69
Organism:
Homo sapiens (Human)
Description:
ChEMBL_34088
Residue:
466
  
Inhibitor
Name:
BDBM50163439
Synonyms:
(2S,3R,4S,5R)-2-Hydroxymethyl-piperidine-3,4,5-triol | CHEMBL176021
Type:
Small organic molecule
Emp. Form.:
C6H13NO4
Mol. Mass.:
163.1717
SMILES:
OC[C@@H]1NC[C@@H](O)[C@H](O)[C@@H]1O
: