Target
Epididymis-specific alpha-mannosidase
Ligand
BDBM50065259
Substrate
Meas. Tech.
ChEBML_305362
IC50
560000±n/a nM
Citation
 Kato, AKato, NKano, EAdachi, IIkeda, KYu, LOkamoto, TBanba, YOuchi, HTakahata, HAsano, N Biological properties of D- and L-1-deoxyazasugars. J Med Chem 48:2036-44 (2005)  
Target
Name:
Epididymis-specific alpha-mannosidase
Synonyms:
KIAA0935 MAN2B2 | Mannosidase alpha class 2B member 2
Type:
PROTEIN
Mol. Mass.:
113992.22
Organism:
Homo sapiens (Human)
Description:
ChEMBL_305362
Residue:
1009
  
Inhibitor
Name:
BDBM50065259
Synonyms:
(2R,3R,4R,5R)-2-(Hydroxymethyl)piperidine-3,4,5-triol, 11 (2R,3R,4R,5R)-2-Hydroxymethyl-piperidine-3,4,5-triol 2-HYDROXYMETHYL-PIPERIDINE-3,4,5-TRIOL deoxymannojirimycin
Type:
Small organic molecule
Emp. Form.:
C6H13NO4
Mol. Mass.:
163.1717
SMILES:
OC[C@H]1NC[C@@H](O)[C@@H](O)[C@@H]1O
: