Target
Putative alpha-glucosidase
Ligand
BDBM50163445
Substrate
Meas. Tech.
ChEBML_305022
IC50
450000±n/a nM
Citation
 Kato, AKato, NKano, EAdachi, IIkeda, KYu, LOkamoto, TBanba, YOuchi, HTakahata, HAsano, N Biological properties of D- and L-1-deoxyazasugars. J Med Chem 48:2036-44 (2005)  
Target
Name:
Putative alpha-glucosidase
Synonyms:
Alpha-glucosidase
Type:
PROTEIN
Mol. Mass.:
102549.55
Organism:
Oryza sativa subsp. japonica
Description:
ChEMBL_304920
Residue:
929
  
Inhibitor
Name:
BDBM50163445
Synonyms:
(2S,3S,4R,5S)-2-Hydroxymethyl-piperidine-3,4,5-triol L-altro-1-Deoxynojirimycin
Type:
Small organic molecule
Emp. Form.:
C6H13NO4
Mol. Mass.:
163.1717
SMILES:
OC[C@@H]1NC[C@H](O)[C@@H](O)[C@H]1O
: