Target
alpha-1,2-Mannosidase
Ligand
BDBM50163438
Substrate
Meas. Tech.
ChEBML_305213
IC50
30000±n/a nM
Citation
 Kato, AKato, NKano, EAdachi, IIkeda, KYu, LOkamoto, TBanba, YOuchi, HTakahata, HAsano, N Biological properties of D- and L-1-deoxyazasugars. J Med Chem 48:2036-44 (2005)  
Target
Name:
alpha-1,2-Mannosidase
Synonyms:
Alpha-mannosidase
Type:
PROTEIN
Mol. Mass.:
65344.50
Organism:
Glycine max
Description:
ChEMBL_32380
Residue:
578
  
Inhibitor
Name:
BDBM50163438
Synonyms:
(2S,3S,4R,5R)-2-Hydroxymethyl-piperidine-3,4,5-triol | CHEMBL179130
Type:
Small organic molecule
Emp. Form.:
C6H13NO4
Mol. Mass.:
163.1717
SMILES:
OC[C@@H]1NC[C@@H](O)[C@@H](O)[C@H]1O
: