Target
Beta-galactosidase
Ligand
BDBM50163447
Substrate
Meas. Tech.
ChEBML_305331
IC50
560000±n/a nM
Citation
 Kato, AKato, NKano, EAdachi, IIkeda, KYu, LOkamoto, TBanba, YOuchi, HTakahata, HAsano, N Biological properties of D- and L-1-deoxyazasugars. J Med Chem 48:2036-44 (2005)  
Target
Name:
Beta-galactosidase
Synonyms:
β-galactosidase Beta-galactosidase/Glucosylceramidase | GLB1
Type:
Protein
Mol. Mass.:
73420.88
Organism:
Bos taurus (Bovine)
Description:
Residue:
653
  
Inhibitor
Name:
BDBM50163447
Synonyms:
(2S,3S,4S,5R)-2-Hydroxymethyl-piperidine-3,4,5-triol | CHEMBL369297
Type:
Small organic molecule
Emp. Form.:
C6H13NO4
Mol. Mass.:
163.1717
SMILES:
OC[C@@H]1NC[C@@H](O)[C@H](O)[C@H]1O
: