Target
Sucrase-isomaltase, intestinal
Ligand
BDBM50065259
Substrate
Meas. Tech.
ChEBML_304937
IC50
110000±n/a nM
Citation
 Kato, AKato, NKano, EAdachi, IIkeda, KYu, LOkamoto, TBanba, YOuchi, HTakahata, HAsano, N Biological properties of D- and L-1-deoxyazasugars. J Med Chem 48:2036-44 (2005)  
Target
Name:
Sucrase-isomaltase, intestinal
Synonyms:
SUIS_RAT Sucrase-isomaltase | alpha-Glucosidase (α-Glucosidase)
Type:
Enzyme
Mol. Mass.:
210329.04
Organism:
Rattus norvegicus (Rat)
Description:
P23739
Residue:
1841
  
Inhibitor
Name:
BDBM50065259
Synonyms:
(2R,3R,4R,5R)-2-(Hydroxymethyl)piperidine-3,4,5-triol, 11 (2R,3R,4R,5R)-2-Hydroxymethyl-piperidine-3,4,5-triol 2-HYDROXYMETHYL-PIPERIDINE-3,4,5-TRIOL deoxymannojirimycin
Type:
Small organic molecule
Emp. Form.:
C6H13NO4
Mol. Mass.:
163.1717
SMILES:
OC[C@H]1NC[C@@H](O)[C@@H](O)[C@@H]1O
: