Target
Neuronal acetylcholine receptor subunit alpha-7
Ligand
BDBM50173942
Substrate
Meas. Tech.
ChEMBL_321014 (CHEMBL871846)
Ki
3.4±n/a nM
Citation
 Baker, SRBoot, JBrunavs, MDobson, DGreen, RHayhurst, LKeenan, MWallace, L High affinity ligands for the alpha7 nicotinic receptor that show no cross-reactivity with the 5-HT3 receptor. Bioorg Med Chem Lett 15:4727-30 (2005)  
Target
Name:
Neuronal acetylcholine receptor subunit alpha-7
Synonyms:
ACHA7_HUMAN Cholinergic, Nicotinic Alpha7 Neuronal acetylcholine receptor protein alpha-7 subunit Nicotinic acetylcholine receptor alpha-7 (alpha7 nAChR)
Type:
Mol. Mass.:
56448.33
Organism:
Homo sapiens (Human)
Description:
CHRNA7 (NACHRA7)
Residue:
502
  
Inhibitor
Name:
BDBM50173942
Synonyms:
CHEMBL195329 | N-[(3R)-1-azabicyclo[2.2.2]oct-3-yl]-5-phenylthiophene-2-carboxamide
Type:
Small organic molecule
Emp. Form.:
C18H20N2OS
Mol. Mass.:
312.429
SMILES:
O=C(N[C@H]1CN2CCC1CC2)c1ccc(s1)-c1ccccc1
: