Target
Neuronal acetylcholine receptor subunit alpha-7
Ligand
BDBM50173944
Substrate
Meas. Tech.
ChEMBL_321014 (CHEMBL871846)
Ki
3.1±n/a nM
Citation
 Baker, SRBoot, JBrunavs, MDobson, DGreen, RHayhurst, LKeenan, MWallace, L High affinity ligands for the alpha7 nicotinic receptor that show no cross-reactivity with the 5-HT3 receptor. Bioorg Med Chem Lett 15:4727-30 (2005)  
Target
Name:
Neuronal acetylcholine receptor subunit alpha-7
Synonyms:
ACHA7_HUMAN Cholinergic, Nicotinic Alpha7 Neuronal acetylcholine receptor protein alpha-7 subunit Nicotinic acetylcholine receptor alpha-7 (alpha7 nAChR)
Type:
Mol. Mass.:
56448.33
Organism:
Homo sapiens (Human)
Description:
CHRNA7 (NACHRA7)
Residue:
502
  
Inhibitor
Name:
BDBM50173944
Synonyms:
5'-phenyl-(2'R)-spiro[4-azabicyclo[2.2.2]octane-2,2'-furo[2,3-b]pyridine] | CHEMBL195345
Type:
Small organic molecule
Emp. Form.:
C19H20N2O
Mol. Mass.:
292.3749
SMILES:
C1c2cc(cnc2O[C@]11CN2CCC1CC2)-c1ccccc1
: