Target
Seed linoleate 13S-lipoxygenase-1
Ligand
BDBM22351
Substrate
Meas. Tech.
ChEMBL_321375 (CHEMBL881519)
IC50
>10000±n/a nM
Citation
 Rao, PNChen, QHKnaus, EE Synthesis and biological evaluation of 1,3-diphenylprop-2-yn-1-ones as dual inhibitors of cyclooxygenases and lipoxygenases. Bioorg Med Chem Lett 15:4842-5 (2005)  
Target
Name:
Seed linoleate 13S-lipoxygenase-1
Synonyms:
15-LOX 15-lipo-oxygenase (SLO) L-1 LOX1.1 Lipoxygenase (LOX) Lipoxygenase-1 | Seed lipoxygenase-1
Type:
Enzyme
Mol. Mass.:
94365.66
Organism:
Glycine max (soybean)
Description:
Residue:
839
  
Inhibitor
Name:
BDBM22351
Synonyms:
1,3-Diarylprop-2-yn-1-one, 13h CHEMBL427356
Type:
Small organic molecule
Emp. Form.:
C16H11FO3S
Mol. Mass.:
302.32
SMILES:
CS(=O)(=O)c1ccc(cc1)C#CC(=O)c1ccc(F)cc1
: