Target
Heat shock protein HSP 90-alpha
Ligand
BDBM50173898
Substrate
Meas. Tech.
ChEMBL_320742 (CHEMBL881215)
Kd
>100000±n/a nM
Citation
 Rastelli, GTian, ZQWang, ZMyles, DLiu, Y Structure-based design of 7-carbamate analogs of geldanamycin. Bioorg Med Chem Lett 15:5016-21 (2005)  
Target
Name:
Heat shock protein HSP 90-alpha
Synonyms:
HS90A_HUMAN HSP86 HSP90AA1 HSPCA Heat shock 86 kDa Heat shock protein HSP 90-alpha (HSP90) LAP-2 Lipopolysaccharide-associated protein 2 heat shock protein 90kDa alpha (cytosolic), class A member 1 isoform 2
Type:
Molecular Chaperone
Mol. Mass.:
84623.45
Organism:
Homo sapiens (Human)
Description:
P07900
Residue:
732
  
Inhibitor
Name:
BDBM50173898
Synonyms:
CHEMBL371539 | Geldanamycin derivative
Type:
Small organic molecule
Emp. Form.:
C30H42FN3O9
Mol. Mass.:
607.6676
SMILES:
CO[C@H]1C[C@H](C)Cc2c(O)c(NC(=O)C(C)=CC=C[C@H](OC)[C@@H](OC(=O)NO)\C(C)=C\[C@H](C)[C@H]1O)cc(O)c2N=CCF
: