Target
D(2) dopamine receptor
Ligand
BDBM50172511
Substrate
Meas. Tech.
ChEMBL_320984 (CHEMBL872131)
Ki
4000±n/a nM
Citation
 Elsner, JBoeckler, FHeinemann, FWHübner, HGmeiner, P Pharmacophore-guided drug discovery investigations leading to bioactive 5-aminotetrahydropyrazolopyridines. Implications for the binding mode of heterocyclic dopamine D3 receptor agonists. J Med Chem 48:5771-9 (2005)  
Target
Name:
D(2) dopamine receptor
Synonyms:
D(2) dopamine receptor DOPAMINE D2 Long DRD2 Dopamine D2 receptor Dopamine D2 receptor (D2R) Dopamine2-like | d2
Type:
Cell-surface receptors
Mol. Mass.:
50647.10
Organism:
Homo sapiens (Human)
Description:
P14416
Residue:
443
  
Inhibitor
Name:
BDBM50172511
Synonyms:
5-Dipropylamino-4,5,6,7-tetrahydro-pyrazolo[1,5-a]pyridine-3-carbaldehyde | CHEMBL198174
Type:
Small organic molecule
Emp. Form.:
C14H23N3O
Mol. Mass.:
249.3519
SMILES:
CCCN(CCC)C1CCn2ncc(C=O)c2C1
: