Target
Platelet-activating factor receptor
Ligand
BDBM50036935
Substrate
Meas. Tech.
ChEMBL_321251 (CHEMBL881786)
IC50
3700±n/a nM
Citation
 Morphy, RRankovic, Z Designed multiple ligands. An emerging drug discovery paradigm. J Med Chem 48:6523-43 (2005)  
Target
Name:
Platelet-activating factor receptor
Synonyms:
PAF Platelet activating factor PAFR PTAFR_HUMAN Platelet-activating factor receptor
Type:
Enzyme Catalytic Domain
Mol. Mass.:
39219.60
Organism:
Homo sapiens (Human)
Description:
PAF Platelet activating factor PTAFR HUMAN::P25105
Residue:
342
  
Inhibitor
Name:
BDBM50036935
Synonyms:
8-Chloro-11-[1-(5-methyl-pyridin-3-ylmethyl)-piperidin-4-ylidene]-6,11-dihydro-5H-benzo[5,6]cyclohepta[1,2-b]pyridine Rupatadine
Type:
Small organic molecule
Emp. Form.:
C26H26ClN3
Mol. Mass.:
415.958
SMILES:
[#6]-c1cncc(-[#6]-[#7]-2-[#6]-[#6]\[#6](-[#6]-[#6]-2)=[#6]-2\c3ccc(Cl)cc3-[#6]-[#6]-c3cccnc-23)c1
: