Target
Sigma non-opioid intracellular receptor 1
Ligand
BDBM50179277
Substrate
Meas. Tech.
ChEMBL_325592 (CHEMBL860270)
EC50
15000±n/a nM
Citation
 Berardi, FFerorelli, SAbate, CPedone, MPColabufo, NAContino, MPerrone, R Methyl substitution on the piperidine ring of N-[omega-(6-methoxynaphthalen-1-yl)alkyl] derivatives as a probe for selective binding and activity at the sigma(1) receptor. J Med Chem 48:8237-44 (2005)  
Target
Name:
Sigma non-opioid intracellular receptor 1
Synonyms:
Opioid receptor SGMR1_RAT Sigma non-opioid intracellular receptor 1 Sigma-1 | Sigmar1
Type:
Enzyme Catalytic Domain
Mol. Mass.:
25266.54
Organism:
RAT
Description:
Q9R0C9
Residue:
223
  
Inhibitor
Name:
BDBM50179277
Synonyms:
1-(4-(6-methoxynaphthalen-1-yl)butyl)-3,3-dimethylpiperidine CHEMBL544343
Type:
Small organic molecule
Emp. Form.:
C22H31NO
Mol. Mass.:
325.4876
SMILES:
COc1ccc2c(CCCCN3CCCC(C)(C)C3)cccc2c1
: