Target
Integrin alpha-V/beta-5
Ligand
BDBM50177884
Substrate
Meas. Tech.
ChEMBL_325768 (CHEMBL863348)
IC50
3.43±n/a nM
Citation
 Casiraghi, GRassu, GAuzzas, LBurreddu, PGaetani, EBattistini, LZanardi, FCurti, CNicastro, GBelvisi, LMotto, ICastorina, MGiannini, GPisano, C Grafting aminocyclopentane carboxylic acids onto the RGD tripeptide sequence generates low nanomolar alphaVbeta3/alphaVbeta5 integrin dual binders. J Med Chem 48:7675-87 (2005)  
Target
Name:
Integrin alpha-V/beta-5
Synonyms:
ITGAV/ITGB5 | Integrin beta-5/Vitronectin receptor alpha
Type:
Enzyme
Mol. Mass.:
Description:
Components:
This complex has 2 components.
Component 1
Name:
Integrin alpha-V
Synonyms:
ITAV_HUMAN Integrin alpha-V/alpha-5 VNRA Vitronectin receptor | Vitronectin receptor subunit alpha
Type:
PROTEIN
Mol. Mass.:
116024.92
Organism:
Homo sapiens (Human)
Description:
ChEMBL_582336
Residue:
1048
  
Component 2
Name:
Integrin beta-5
Synonyms:
ITB5_HUMAN | ITGB5
Type:
PROTEIN
Mol. Mass.:
88047.37
Organism:
Homo sapiens (Human)
Description:
EBI_10915
Residue:
799
  
Inhibitor
Name:
BDBM50177884
Synonyms:
CHEMBL534934 | c-[-Arg-Gly-Asp-Acpca31-]
Type:
Small organic molecule
Emp. Form.:
C18H29N7O6
Mol. Mass.:
439.4662
SMILES:
[#7]\[#6](-[#7])=[#7]\[#6]-[#6]-[#6]-[#6@@H]-1-[#7]-[#6](=O)-[#6@H]-2-[#6]-[#6]-[#6@H](-[#6]-2)-[#7]-[#6](=O)-[#6@H](-[#6]-[#6](-[#8])=O)-[#7]-[#6](=O)-[#6]-[#7]-[#6]-1=O
: